Reaction Details
TargetAurora kinase B
LigandBDBM50442757
Substrate/Competitorn/a
Meas. Tech.ChEMBL_989491 (CHEMBL2444018)
IC50>10.0±n/a nM
Citation Brasca, MGMantegani, SAmboldi, NBindi, SCaronni, DCasale, ECeccarelli, WColombo, NDe Ponti, ADonati, DErmoli, AFachin, GFelder, ERFerguson, RDFiorelli, CGuanci, MIsacchi, APesenti, EPolucci, PRiceputi, LSola, FVisco, CZuccotto, FFogliatto, G Discovery of NMS-E973 as novel, selective and potent inhibitor of heat shock protein 90 (Hsp90). Bioorg Med Chem21:7047-63 (2013) 
 
Aurora kinase B
Name:Aurora kinase B
Type:Protein
Mol. Mass.:39327.72
Organism:Homo sapiens (Human)
Description:Q96GD4
Residue:344
BDBM50442757
NameBDBM50442757
Synonyms:CHEMBL2443026
TypeSmall organic molecule
Emp. Form.C31H38N4O7
Mol. Mass.578.656
SMILESCN(C)c1ccc(Oc2cc(O)cc(O)c2-c2cc(no2)C(=O)NC2CCN(CC2)C2CCC3(CC2)OCCO3)cc1