Reaction Details
TargetAromatase
LigandBDBM50442764
Substrate/Competitorn/a
Meas. Tech.ChEMBL_989965 (CHEMBL2447322)
Ki 130±n/a nM
Citation McNulty, JNielsen, AJBrown, CEDiFrancesco, BRVurgun, NNair, JJCrankshaw, DJHolloway, AC Investigation of aryl halides as ketone bioisosteres: refinement of potent and selective inhibitors of human cytochrome P450 19A1 (aromatase). Bioorg Med Chem Lett23:6060-3 (2013) 
 
Aromatase
Name:Aromatase
Type:Enzyme
Mol. Mass.:57888.92
Organism:Homo sapiens (Human)
Description:P11511
Residue:503
BDBM50442764
NameBDBM50442764
Synonyms:CHEMBL2443360
TypeSmall organic molecule
Emp. Form.C17H16BrN3O
Mol. Mass.358.232
SMILESO[C@H]([C@H](Cn1ccnn1)c1ccccc1)c1ccc(Br)cc1