Reaction Details
TargetRho-associated protein kinase 2
LigandBDBM50442810
Substrate/Competitorn/a
Meas. Tech.ChEMBL_990098 (CHEMBL2444040)
IC50 167±n/a nM
Citation Boland, SDefert, OAlen, JBourin, ACastermans, KKindt, NBoumans, NPanitti, LVan de Velde, SStalmans, ILeysen, D 3-[2-(Aminomethyl)-5-[(pyridin-4-yl)carbamoyl]phenyl] benzoates as soft ROCK inhibitors. Bioorg Med Chem Lett23:6442-6 (2013) 
 
Rho-associated protein kinase 2
Name:Rho-associated protein kinase 2
Type:Protein
Mol. Mass.:160885.43
Organism:Homo sapiens (Human)
Description:O75116
Residue:1388
BDBM50442810
NameBDBM50442810
Synonyms:CHEMBL2440739
TypeSmall organic molecule
Emp. Form.C20H17N3O3
Mol. Mass.347.3673
SMILESNCc1ccc(cc1-c1cccc(c1)C(O)=O)C(=O)Nc1ccncc1