Reaction Details
TargetRho-associated protein kinase 2
LigandBDBM50442829
Substrate/Competitorn/a
Meas. Tech.ChEMBL_990098 (CHEMBL2444040)
IC50 13±n/a nM
Citation Boland, SDefert, OAlen, JBourin, ACastermans, KKindt, NBoumans, NPanitti, LVan de Velde, SStalmans, ILeysen, D 3-[2-(Aminomethyl)-5-[(pyridin-4-yl)carbamoyl]phenyl] benzoates as soft ROCK inhibitors. Bioorg Med Chem Lett23:6442-6 (2013) 
 
Rho-associated protein kinase 2
Name:Rho-associated protein kinase 2
Type:Protein
Mol. Mass.:160885.43
Organism:Homo sapiens (Human)
Description:O75116
Residue:1388
BDBM50442829
NameBDBM50442829
Synonyms:CHEMBL2440755
TypeSmall organic molecule
Emp. Form.C26H26FN3O3
Mol. Mass.447.5013
SMILESNCc1ccc(cc1-c1cccc(c1)C(=O)OCC1CCCC1)C(=O)Nc1ccncc1F