Reaction Details
TargetNeutrophil elastase
LigandBDBM50442864
Substrate/Competitorn/a
Meas. Tech.ChEMBL_990378 (CHEMBL2446014)
IC50 7800±n/a nM
Citation Bondada, LRondla, RPradere, ULiu, PLi, CBobeck, DMcBrayer, TTharnish, PCourcambeck, JHalfon, PWhitaker, TAmblard, FCoats, SJSchinazi, RF Azetidines and spiro azetidines as novel P2 units in hepatitis C virus NS3 protease inhibitors. Bioorg Med Chem Lett23:6325-30 (2013) 
 
Neutrophil elastase
Name:Neutrophil elastase
Type:Enzyme
Mol. Mass.:28532.38
Organism:Homo sapiens (Human)
Description:P08246
Residue:267
BDBM50442864
NameBDBM50442864
Synonyms:CHEMBL2441773
TypeSmall organic molecule
Emp. Form.C37H55N7O6
Mol. Mass.693.8759
SMILESCCCC(NC(=O)C1N(CC11CCCCC1)C(=O)[C@@H](NC(=O)[C@@H](NC(=O)c1cnccn1)C1CCCCC1)C(C)(C)C)C(=O)C(=O)NC1CC1