Reaction Details
TargetPlasminogen
LigandBDBM50326055
Substrate/Competitorn/a
Meas. Tech.ChEMBL_990377 (CHEMBL2446013)
IC50>100000±n/a nM
Citation Bondada, LRondla, RPradere, ULiu, PLi, CBobeck, DMcBrayer, TTharnish, PCourcambeck, JHalfon, PWhitaker, TAmblard, FCoats, SJSchinazi, RF Azetidines and spiro azetidines as novel P2 units in hepatitis C virus NS3 protease inhibitors. Bioorg Med Chem Lett23:6325-30 (2013) 
 
Plasminogen
Name:Plasminogen
Type:Enzyme
Mol. Mass.:90579.18
Organism:Homo sapiens (Human)
Description:n/a
Residue:810
BDBM50326055
NameBDBM50326055
Synonyms:(1R,21S,24S)-21-tert-Butyl-N-((1R,2R)-1-{[(cyclopropylsulfonyl)amino]carbonyl}-2-ethylcyclopropyl)-16,16-dimethyl-3,19,22-trioxo-2,18-dioxa-4,20,23-triazatetracyclo[21.2.1.14,7.06,11]-heptacosa-6,8,10-triene-24-carboxamide CHEMBL599872 | MK-7009
TypeSmall organic molecule
Emp. Form.C38H53N5O9S
Mol. Mass.755.921
SMILESCC(C)(C)[C@@H]1NC(=O)OCC(C)(C)CCCCc2cccc3CN(Cc23)C(=O)O[C@@H]2C[C@H](N(C2)C1=O)C(=O)N[C@@]1(C[C@H]1C=C)C(=O)NS(=O)(=O)C1CC1