Reaction Details
TargetSolute carrier organic anion transporter family member 1B3
LigandBDBM50442897
Substrate/Competitorn/a
Meas. Tech.ChEMBL_1265866 (CHEMBL3039492)
IC50 3388±n/a nM
Citation De Bruyn, Tvan Westen, GJIjzerman, APStieger, Bde Witte, PAugustijns, PFAnnaert, PP Structure-based identification of OATP1B1/3 inhibitors. Mol Pharmacol83:1257-67 (2013) 
 
Solute carrier organic anion transporter family member 1B3
Name:Solute carrier organic anion transporter family member 1B3
Type:Protein
Mol. Mass.:77425.75
Organism:Homo sapiens (Human)
Description:Q9NPD5
Residue:702
BDBM50442897
NameBDBM50442897
Synonyms:BILIRUBIN
TypeSmall organic molecule
Emp. Form.C33H36N4O6
Mol. Mass.584.6621
SMILESCC1=C(C=C)\C(NC1=O)=C\c1[nH]c(Cc2[nH]c(\C=C3/NC(=O)C(C=C)=C3C)c(C)c2CCC(O)=O)c(CCC(O)=O)c1C