Reaction Details
TargetSolute carrier organic anion transporter family member 1B1
LigandBDBM50148911
Substrate/Competitorn/a
Meas. Tech.ChEMBL_1265863 (CHEMBL3039489)
IC50 15849±n/a nM
Citation De Bruyn, Tvan Westen, GJIjzerman, APStieger, Bde Witte, PAugustijns, PFAnnaert, PP Structure-based identification of OATP1B1/3 inhibitors. Mol Pharmacol83:1257-67 (2013) 
 
Solute carrier organic anion transporter family member 1B1
Name:Solute carrier organic anion transporter family member 1B1
Type:Protein
Mol. Mass.:76468.06
Organism:Homo sapiens (Human)
Description:Q9Y6L6
Residue:691
BDBM50148911
NameBDBM50148911
Synonyms:(3beta)-3-hydroxyurs-12-en-28-oic acid CHEMBL169 malol urson
TypeSmall organic molecule
Emp. Form.C30H48O3
Mol. Mass.456.7003
SMILESC[C@@H]1CC[C@@]2(CC[C@]3(C)C(=CC[C@@H]4[C@@]5(C)CC[C@H](O)C(C)(C)[C@@H]5CC[C@@]34C)[C@@H]2[C@H]1C)C(O)=O