Reaction Details
TargetSolute carrier organic anion transporter family member 1B3
LigandBDBM50442866
Substrate/Competitorn/a
Meas. Tech.ChEMBL_1265866 (CHEMBL3039492)
IC50 3236±n/a nM
Citation De Bruyn, Tvan Westen, GJIjzerman, APStieger, Bde Witte, PAugustijns, PFAnnaert, PP Structure-based identification of OATP1B1/3 inhibitors. Mol Pharmacol83:1257-67 (2013) 
 
Solute carrier organic anion transporter family member 1B3
Name:Solute carrier organic anion transporter family member 1B3
Type:Protein
Mol. Mass.:77425.75
Organism:Homo sapiens (Human)
Description:Q9NPD5
Residue:702
BDBM50442866
NameBDBM50442866
Synonyms:beta-DIHYDROGEDUNOL
TypeSmall organic molecule
Emp. Form.C28H38O7
Mol. Mass.486.5971
SMILES[H][C@]12O[C@@]11[C@@](C)(CC[C@]3([H])[C@@]4(C)CC[C@H](O)C(C)(C)[C@]4([H])C[C@@H](OC(C)=O)[C@@]13C)[C@@H](OC2=O)c1ccoc1