Reaction Details
TargetSolute carrier organic anion transporter family member 1B3
LigandBDBM50442873
Substrate/Competitorn/a
Meas. Tech.ChEMBL_1265866 (CHEMBL3039492)
IC50 3388±n/a nM
Citation De Bruyn, Tvan Westen, GJIjzerman, APStieger, Bde Witte, PAugustijns, PFAnnaert, PP Structure-based identification of OATP1B1/3 inhibitors. Mol Pharmacol83:1257-67 (2013) 
 
Solute carrier organic anion transporter family member 1B3
Name:Solute carrier organic anion transporter family member 1B3
Type:Protein
Mol. Mass.:77425.75
Organism:Homo sapiens (Human)
Description:Q9NPD5
Residue:702
BDBM50442873
NameBDBM50442873
Synonyms:PRIEURIANIN
TypeSmall organic molecule
Emp. Form.C37H48O16
Mol. Mass.748.7674
SMILES[H][C@@]1([C@@H](OC=O)[C@H](OC(=O)[C@H](O)[C@H](C)CC)[C@@]2(C)[C@@H](CC(=O)[C@]2(O)C1=C)c1ccoc1)[C@@]1(C)[C@H](CC(=O)O[C@](C)(COC(C)=O)[C@@H]1C(=O)OC)OC(C)=O