Reaction Details
TargetSolute carrier organic anion transporter family member 1B3
LigandBDBM79589
Substrate/Competitorn/a
Meas. Tech.ChEMBL_1265867 (CHEMBL3039493)
Ki 590±n/a nM
Citation De Bruyn, Tvan Westen, GJIjzerman, APStieger, Bde Witte, PAugustijns, PFAnnaert, PP Structure-based identification of OATP1B1/3 inhibitors. Mol Pharmacol83:1257-67 (2013) 
 
Solute carrier organic anion transporter family member 1B3
Name:Solute carrier organic anion transporter family member 1B3
Type:Protein
Mol. Mass.:77425.75
Organism:Homo sapiens (Human)
Description:Q9NPD5
Residue:702
BDBM79589
NameBDBM79589
Synonyms:LASALOCID A SODIUM SMR000538906 | cid_6426773
TypeSmall organic molecule
Emp. Form.C34H53NaO8
Mol. Mass.612.7696
SMILES[Na+].[H][C@@]1(O[C@@](CC)(C[C@@H]1C)[C@@]1([H])CC[C@](O)(CC)[C@H](C)O1)[C@@H](CC)C(=O)[C@@H](C)[C@@H](O)[C@H](C)CCc1ccc(C)c(O)c1C([O-])=O