Reaction Details
TargetSolute carrier organic anion transporter family member 1B3
LigandBDBM50442901
Substrate/Competitorn/a
Meas. Tech.ChEMBL_1265867 (CHEMBL3039493)
Ki 4080±n/a nM
Citation De Bruyn, Tvan Westen, GJIjzerman, APStieger, Bde Witte, PAugustijns, PFAnnaert, PP Structure-based identification of OATP1B1/3 inhibitors. Mol Pharmacol83:1257-67 (2013) 
 
Solute carrier organic anion transporter family member 1B3
Name:Solute carrier organic anion transporter family member 1B3
Type:Protein
Mol. Mass.:77425.75
Organism:Homo sapiens (Human)
Description:Q9NPD5
Residue:702
BDBM50442901
NameBDBM50442901
Synonyms:Abietic Acid | acs.jmedchem.1c00409_ST.770
TypeSmall organic molecule
Emp. Form.C20H30O2
Mol. Mass.302.451
SMILES[H][C@]12CCC(=CC1=CC[C@@]1([H])[C@@](C)(CCC[C@]21C)C(O)=O)C(C)C