Reaction Details
TargetSolute carrier organic anion transporter family member 1B3
LigandBDBM50005105
Substrate/Competitorn/a
Meas. Tech.ChEMBL_1265867 (CHEMBL3039493)
Ki 1480±n/a nM
Citation De Bruyn, Tvan Westen, GJIjzerman, APStieger, Bde Witte, PAugustijns, PFAnnaert, PP Structure-based identification of OATP1B1/3 inhibitors. Mol Pharmacol83:1257-67 (2013) 
 
Solute carrier organic anion transporter family member 1B3
Name:Solute carrier organic anion transporter family member 1B3
Type:Protein
Mol. Mass.:77425.75
Organism:Homo sapiens (Human)
Description:Q9NPD5
Residue:702
BDBM50005105
NameBDBM50005105
Synonyms:CARBENOXOLONE DISODIUM Carbenoxolone Sodium
TypeSmall organic molecule
Emp. Form.C34H48Na2O7
Mol. Mass.614.7203
SMILES[Na+].[Na+].[H][C@@]12C[C@](C)(CC[C@]1(C)CC[C@]1(C)C2=CC(=O)[C@]2([H])[C@@]3(C)CC[C@H](OC(=O)CCC([O-])=O)C(C)(C)[C@]3([H])CC[C@@]12C)C([O-])=O