Reaction Details
TargetSolute carrier organic anion transporter family member 1B1
LigandBDBM50442900
Substrate/Competitorn/a
Meas. Tech.ChEMBL_1265864 (CHEMBL3039490)
Ki 830±n/a nM
Citation De Bruyn, Tvan Westen, GJIjzerman, APStieger, Bde Witte, PAugustijns, PFAnnaert, PP Structure-based identification of OATP1B1/3 inhibitors. Mol Pharmacol83:1257-67 (2013) 
 
Solute carrier organic anion transporter family member 1B1
Name:Solute carrier organic anion transporter family member 1B1
Type:Protein
Mol. Mass.:76468.06
Organism:Homo sapiens (Human)
Description:Q9Y6L6
Residue:691
BDBM50442900
NameBDBM50442900
Synonyms:CHEMBL3138711
TypeSmall organic molecule
Emp. Form.C28H34O6
Mol. Mass.466.566
SMILES[H][C@@]12CC[C@]3(C)[C@H](OC(=O)C=C3[C@@]1(C)[C@@H](C[C@]1([H])C(C)(C)C(=O)C=C[C@@]21C)OC(C)=O)c1ccoc1