Reaction Details
TargetSolute carrier organic anion transporter family member 1B3
LigandBDBM50233538
Substrate/Competitorn/a
Meas. Tech.ChEMBL_1265867 (CHEMBL3039493)
Ki 420±n/a nM
Citation De Bruyn, Tvan Westen, GJIjzerman, APStieger, Bde Witte, PAugustijns, PFAnnaert, PP Structure-based identification of OATP1B1/3 inhibitors. Mol Pharmacol83:1257-67 (2013) 
 
Solute carrier organic anion transporter family member 1B3
Name:Solute carrier organic anion transporter family member 1B3
Type:Protein
Mol. Mass.:77425.75
Organism:Homo sapiens (Human)
Description:Q9NPD5
Residue:702
BDBM50233538
NameBDBM50233538
Synonyms:18beta-glycyrrhetic acid CHEMBL230006 glycyrrhetinic acid
TypeSmall organic molecule
Emp. Form.C30H46O4
Mol. Mass.470.6838
SMILESCC1(C)[C@@H](O)CC[C@@]2(C)[C@H]1CC[C@]1(C)[C@@H]2C(=O)C=C2[C@@H]3C[C@](C)(CC[C@]3(C)CC[C@@]12C)C(O)=O