Reaction Details
TargetSolute carrier organic anion transporter family member 1B3
LigandBDBM50442902
Substrate/Competitorn/a
Meas. Tech.ChEMBL_1265867 (CHEMBL3039493)
Ki 2270±n/a nM
Citation De Bruyn, Tvan Westen, GJIjzerman, APStieger, Bde Witte, PAugustijns, PFAnnaert, PP Structure-based identification of OATP1B1/3 inhibitors. Mol Pharmacol83:1257-67 (2013) 
 
Solute carrier organic anion transporter family member 1B3
Name:Solute carrier organic anion transporter family member 1B3
Type:Protein
Mol. Mass.:77425.75
Organism:Homo sapiens (Human)
Description:Q9NPD5
Residue:702
BDBM50442902
NameBDBM50442902
Synonyms:CHEMBL3138712
TypeSmall organic molecule
Emp. Form.C30H40O9
Mol. Mass.544.6332
SMILES[H][C@]12O[C@@]11[C@](C)(CC[C@]3([H])[C@@]4(C)[C@H](C[C@@H](OC(C)=O)C(C)(C)[C@]4([H])C[C@@H](O)[C@]13C)OC(C)=O)[C@H](OC2=O)c1ccoc1