Reaction Details
TargetSolute carrier organic anion transporter family member 1B1
LigandBDBM50442883
Substrate/Competitorn/a
Meas. Tech.ChEMBL_1265864 (CHEMBL3039490)
Ki 480±n/a nM
Citation De Bruyn, Tvan Westen, GJIjzerman, APStieger, Bde Witte, PAugustijns, PFAnnaert, PP Structure-based identification of OATP1B1/3 inhibitors. Mol Pharmacol83:1257-67 (2013) 
 
Solute carrier organic anion transporter family member 1B1
Name:Solute carrier organic anion transporter family member 1B1
Type:Protein
Mol. Mass.:76468.06
Organism:Homo sapiens (Human)
Description:Q9Y6L6
Residue:691
BDBM50442883
NameBDBM50442883
Synonyms:CHEMBL3138678
TypeSmall organic molecule
Emp. Form.C34H44O12
Mol. Mass.644.706
SMILES[H][C@]12O[C@@]11[C@@](C)(C[C@@H](OC(C)=O)[C@]3([H])[C@@]4(C)[C@H](C[C@@H](OC(C)=O)C(C)(C)[C@]4([H])C[C@@H](OC(C)=O)[C@@]13C)OC(C)=O)[C@@H](OC2=O)c1ccoc1