Reaction Details
TargetSolute carrier organic anion transporter family member 1B1
LigandBDBM50442889
Substrate/Competitorn/a
Meas. Tech.ChEMBL_1265864 (CHEMBL3039490)
Ki 380±n/a nM
Citation De Bruyn, Tvan Westen, GJIjzerman, APStieger, Bde Witte, PAugustijns, PFAnnaert, PP Structure-based identification of OATP1B1/3 inhibitors. Mol Pharmacol83:1257-67 (2013) 
 
Solute carrier organic anion transporter family member 1B1
Name:Solute carrier organic anion transporter family member 1B1
Type:Protein
Mol. Mass.:76468.06
Organism:Homo sapiens (Human)
Description:Q9Y6L6
Residue:691
BDBM50442889
NameBDBM50442889
Synonyms:CHEMBL3039300
TypeSmall organic molecule
Emp. Form.C41H52O17
Mol. Mass.816.8414
SMILESCCC(C)C(=O)O[C@@H]1C[C@@]2(C)[C@@H](OC(=O)CC22OC3(C)O[C@]11[C@]4(C)[C@@H](CC(=O)OC)C5(C)CC4(O)[C@](O)(C5OC(=O)C4(C)OC4C)[C@@H](OC(C)=O)[C@]21O3)c1ccoc1