Reaction Details
TargetSolute carrier organic anion transporter family member 1B1
LigandBDBM22319
Substrate/Competitorn/a
Meas. Tech.ChEMBL_1265864 (CHEMBL3039490)
Ki 330±n/a nM
Citation De Bruyn, Tvan Westen, GJIjzerman, APStieger, Bde Witte, PAugustijns, PFAnnaert, PP Structure-based identification of OATP1B1/3 inhibitors. Mol Pharmacol83:1257-67 (2013) 
 
Solute carrier organic anion transporter family member 1B1
Name:Solute carrier organic anion transporter family member 1B1
Type:Protein
Mol. Mass.:76468.06
Organism:Homo sapiens (Human)
Description:Q9Y6L6
Residue:691
BDBM22319
NameBDBM22319
Synonyms:(5Z,8Z,11Z,14Z)-icosa-5,8,11,14-tetraenoic acid Arachidonic acid (AA) [1-14C]Arachidonic acid
TypeUnsaturated fatty acid
Emp. Form.C20H32O2
Mol. Mass.304.4669
SMILESCCCCC\C=C/C\C=C/C\C=C/C\C=C/CCCC(O)=O