Reaction Details
TargetSolute carrier organic anion transporter family member 1B3
LigandBDBM50442906
Substrate/Competitorn/a
Meas. Tech.ChEMBL_1265867 (CHEMBL3039493)
Ki 440±n/a nM
Citation De Bruyn, Tvan Westen, GJIjzerman, APStieger, Bde Witte, PAugustijns, PFAnnaert, PP Structure-based identification of OATP1B1/3 inhibitors. Mol Pharmacol83:1257-67 (2013) 
 
Solute carrier organic anion transporter family member 1B3
Name:Solute carrier organic anion transporter family member 1B3
Type:Protein
Mol. Mass.:77425.75
Organism:Homo sapiens (Human)
Description:Q9NPD5
Residue:702
BDBM50442906
NameBDBM50442906
Synonyms:Oligomycin
TypeSmall organic molecule
Emp. Form.C45H74O11
Mol. Mass.791.0625
SMILES[H][C@]12CC[C@@H](CC)\C=C\C=C\C[C@@H](C)[C@H](O)[C@@](C)(O)C(=O)[C@@H](C)[C@H](O)[C@@H](C)C(=O)[C@@H](C)[C@H](O)[C@@H](C)\C=C\C(=O)O[C@]([H])([C@@H]1C)[C@H](C)[C@@]1(CC[C@H](C)[C@H](C[C@@H](C)O)O1)O2