Reaction Details
TargetSolute carrier organic anion transporter family member 1B3
LigandBDBM50442878
Substrate/Competitorn/a
Meas. Tech.ChEMBL_1265867 (CHEMBL3039493)
Ki 780±n/a nM
Citation De Bruyn, Tvan Westen, GJIjzerman, APStieger, Bde Witte, PAugustijns, PFAnnaert, PP Structure-based identification of OATP1B1/3 inhibitors. Mol Pharmacol83:1257-67 (2013) 
 
Solute carrier organic anion transporter family member 1B3
Name:Solute carrier organic anion transporter family member 1B3
Type:Protein
Mol. Mass.:77425.75
Organism:Homo sapiens (Human)
Description:Q9NPD5
Residue:702
BDBM50442878
NameBDBM50442878
Synonyms:Beta-Escin
TypeSmall organic molecule
Emp. Form.C54H84O24
Mol. Mass.1117.2304
SMILES[H][C@@]1(O[C@H]2[C@H](O)[C@@H](O[C@]3([H])O[C@H](CO)[C@@H](O)[C@H](O)[C@H]3O)[C@]([H])(O[C@H]3CC[C@@]4(C)C(CC[C@]5(C)[C@]4([H])CC=C4C6CC(C)(C)[C@@H](OC(=O)C(\C)=C\C)[C@H](OC(C)=O)[C@]6(CO)[C@H](O)C[C@]54C)[C@H]3CO)O[C@@H]2C(O)=O)O[C@H](CO)[C@@H](O)[C@H](O)[C@H]1O