Reaction Details
TargetSolute carrier organic anion transporter family member 1B1
LigandBDBM50442867
Substrate/Competitorn/a
Meas. Tech.ChEMBL_1265864 (CHEMBL3039490)
Ki 650±n/a nM
Citation De Bruyn, Tvan Westen, GJIjzerman, APStieger, Bde Witte, PAugustijns, PFAnnaert, PP Structure-based identification of OATP1B1/3 inhibitors. Mol Pharmacol83:1257-67 (2013) 
 
Solute carrier organic anion transporter family member 1B1
Name:Solute carrier organic anion transporter family member 1B1
Type:Protein
Mol. Mass.:76468.06
Organism:Homo sapiens (Human)
Description:Q9Y6L6
Residue:691
BDBM50442867
NameBDBM50442867
Synonyms:CHEMBL1456870
TypeSmall organic molecule
Emp. Form.C38H46O9
Mol. Mass.646.7664
SMILES[#6]\[#6](-[#6])=[#6]/[#6]-[#6]C1([#6])[#8]-c2c(-[#6]\[#6]=[#6](/[#6])-[#6])c3-[#8]C45[#6](-[#6]-[#6]-[#6]=[#6]4-[#6](=O)-c3c(-[#8])c2-[#6]=[#6]1)C([#6])([#6])[#8][C@@]5([#6]\[#6]=[#6](/[#6])-[#6](-[#8])=O)[#6](-[#8])=O