Reaction Details
TargetSolute carrier organic anion transporter family member 1B1
LigandBDBM50442877
Substrate/Competitorn/a
Meas. Tech.ChEMBL_1265864 (CHEMBL3039490)
Ki 800±n/a nM
Citation De Bruyn, Tvan Westen, GJIjzerman, APStieger, Bde Witte, PAugustijns, PFAnnaert, PP Structure-based identification of OATP1B1/3 inhibitors. Mol Pharmacol83:1257-67 (2013) 
 
Solute carrier organic anion transporter family member 1B1
Name:Solute carrier organic anion transporter family member 1B1
Type:Protein
Mol. Mass.:76468.06
Organism:Homo sapiens (Human)
Description:Q9Y6L6
Residue:691
BDBM50442877
NameBDBM50442877
Synonyms:METHYL 6-ACETOXYANGOLENSATE
TypeSmall organic molecule
Emp. Form.C29H36O9
Mol. Mass.528.5907
SMILESCOC(=O)C(OC(C)=O)[C@H]1C(C)(C)C(=O)C[C@@H]2O[C@]34CC(=O)O[C@@H](c5ccoc5)[C@]3(C)CC[C@@H](C4=C)[C@]12C