Reaction Details
TargetKiSS-1 receptor
LigandBDBM50442968
Substrate/Competitorn/a
Meas. Tech.ChEMBL_1276485 (CHEMBL3088609)
Ki 0.040000±n/a nM
Citation Asami, TNishizawa, NMatsui, HNishibori, KIshibashi, YHorikoshi, YNakayama, MMatsumoto, STarui, NYamaguchi, MMatsumoto, HOhtaki, TKitada, C Design, synthesis, and biological evaluation of novel investigational nonapeptide KISS1R agonists with testosterone-suppressive activity. J Med Chem56:8298-307 (2013) 
 
KiSS-1 receptor
Name:KiSS-1 receptor
Type:PROTEIN
Mol. Mass.:42915.37
Organism:Rattus norvegicus
Description:ChEMBL_1448383
Residue:396
BDBM50442968
NameBDBM50442968
Synonyms:CHEMBL3087793
TypeSmall organic molecule
Emp. Form.C62H82N18O14
Mol. Mass.1303.4267
SMILESCC(C)C[C@H](NC(=O)NNC(=O)[C@H](Cc1ccccc1)NC(=O)[C@H](CO)NC(=O)[C@H](CC(N)=O)NC(=O)[C@H](Cc1c[nH]c2ccccc12)NC(=O)[C@H](CC(N)=O)NC(=O)[C@@H](N)Cc1ccc(O)cc1)C(=O)N[C@@H](CCCN=C(N)N)C(=O)N[C@@H](Cc1ccccc1)C(N)=O