Reaction Details
TargetKiSS-1 receptor
LigandBDBM50442975
Substrate/Competitorn/a
Meas. Tech.ChEMBL_1276486 (CHEMBL3088610)
Ki 0.200000±n/a nM
Citation Asami, TNishizawa, NMatsui, HNishibori, KIshibashi, YHorikoshi, YNakayama, MMatsumoto, STarui, NYamaguchi, MMatsumoto, HOhtaki, TKitada, C Design, synthesis, and biological evaluation of novel investigational nonapeptide KISS1R agonists with testosterone-suppressive activity. J Med Chem56:8298-307 (2013) 
 
KiSS-1 receptor
Name:KiSS-1 receptor
Type:G Protein-Coupled Receptor (GPCR)
Mol. Mass.:42613.79
Organism:Homo sapiens (Human)
Description:Binding assay was performed using membranes from the CHO cell transfectants.
Residue:398
BDBM50442975
NameBDBM50442975
Synonyms:CHEMBL3085807
TypeSmall organic molecule
Emp. Form.C60H88N18O13
Mol. Mass.1269.4535
SMILESCNC(N)=NCCC[C@H](NC(=O)[C@H](CC(C)C)NC(=O)NNC(=O)[C@H](Cc1ccccc1)NC(=O)[C@H](CO)NC(=O)[C@H](CC(N)=O)NC(=O)[C@H](CC1CCCCC1)NC(=O)[C@@H](CC(N)=O)NC(=O)[C@H](N)Cc1cccnc1)C(=O)N[C@@H](Cc1ccccc1)C(N)=O