Reaction Details
TargetHistone-lysine N-methyltransferase, H3 lysine-79 specific
LigandBDBM50443017
Substrate/Competitorn/a
Meas. Tech.ChEMBL_1275652 (CHEMBL3090823)
Ki 70±n/a nM
Citation Anglin, JLSong, Y A medicinal chemistry perspective for targeting histone H3 lysine-79 methyltransferase DOT1L. J Med Chem56:8972-83 (2013) 
 
Histone-lysine N-methyltransferase, H3 lysine-79 specific
Name:Histone-lysine N-methyltransferase, H3 lysine-79 specific
Type:Protein
Mol. Mass.:184911.91
Organism:Homo sapiens (Human)
Description:Q8TEK3
Residue:1537
BDBM50443017
NameBDBM50443017
Synonyms:CHEMBL3087504
TypeSmall organic molecule
Emp. Form.C24H33N7O4S
Mol. Mass.515.628
SMILESCC(C)(C)c1ccc(NC(=O)NCCCSC[C@H]2O[C@H]([C@H](O)[C@@H]2O)n2cnc3c(N)ncnc23)cc1