Reaction Details
TargetHistone-lysine N-methyltransferase, H3 lysine-79 specific
LigandBDBM50443019
Substrate/Competitorn/a
Meas. Tech.ChEMBL_1275652 (CHEMBL3090823)
Ki 1.3±n/a nM
Citation Anglin, JLSong, Y A medicinal chemistry perspective for targeting histone H3 lysine-79 methyltransferase DOT1L. J Med Chem56:8972-83 (2013) 
 
Histone-lysine N-methyltransferase, H3 lysine-79 specific
Name:Histone-lysine N-methyltransferase, H3 lysine-79 specific
Type:Protein
Mol. Mass.:184911.91
Organism:Homo sapiens (Human)
Description:Q8TEK3
Residue:1537
BDBM50443019
NameBDBM50443019
Synonyms:CHEMBL3087502
TypeSmall organic molecule
Emp. Form.C28H40N8O3
Mol. Mass.536.669
SMILESCC(C)N(CCCNC(=O)Nc1ccc(cc1)C(C)(C)C)CC1=C[C@H]([C@H](O)[C@@H]1O)n1cnc2c(N)ncnc12