Reaction Details
TargetFarnesyl pyrophosphate synthase
LigandBDBM50443054
Substrate/Competitorn/a
Meas. Tech.ChEMBL_1275828 (CHEMBL3091236)
IC50 21±n/a nM
Citation Leung, CYPark, JDe Schutter, JWSebag, MBerghuis, AMTsantrizos, YS Thienopyrimidine bisphosphonate (ThPBP) inhibitors of the human farnesyl pyrophosphate synthase: optimization and characterization of the mode of inhibition. J Med Chem56:7939-50 (2013) 
 
Farnesyl pyrophosphate synthase
Name:Farnesyl pyrophosphate synthase
Type:Enzyme
Mol. Mass.:48272.89
Organism:Homo sapiens (Human)
Description:P14324
Residue:419
BDBM50443054
NameBDBM50443054
Synonyms:CHEMBL3087934 | US11279719, Example C-12
TypeSmall organic molecule
Emp. Form.C14H12F3N3O6P2S
Mol. Mass.469.269
SMILESOP(O)(=O)C(Nc1ncnc2sc(cc12)-c1ccc(cc1)C(F)(F)F)P(O)(O)=O