Reaction Details
TargetMetabotropic glutamate receptor 5
LigandBDBM50443085
Substrate/Competitorn/a
Meas. Tech.ChEMBL_1276187 (CHEMBL3089425)
IC50 72±n/a nM
Citation Kubas, HMeyer, UHechenberger, MKlein, KUPlitt, PZemribo, RSpexgoor, HWvan Assema, SGAbel, U Scaffold hopping approach towards various AFQ-056 analogs as potent metabotropic glutamate receptor 5 negative allosteric modulators. Bioorg Med Chem Lett23:6370-6 (2013) 
 
Metabotropic glutamate receptor 5
Name:Metabotropic glutamate receptor 5
Type:Enzyme
Mol. Mass.:132484.72
Organism:Homo sapiens (Human)
Description:n/a
Residue:1212
BDBM50443085
NameBDBM50443085
Synonyms:AFQ056 | Mavoglurant
TypeSmall organic molecule
Emp. Form.C19H23NO3
Mol. Mass.313.3908
SMILESCOC(=O)N1CC[C@@H]2[C@H]1CCC[C@@]2(O)C#Cc1cccc(C)c1