Reaction Details
TargetD(2) dopamine receptor
LigandBDBM50443102
Substrate/Competitorn/a
Meas. Tech.ChEMBL_1276332 (CHEMBL3089794)
Ki 23±n/a nM
Citation Shonberg, JHerenbrink, CKLópez, LChristopoulos, AScammells, PJCapuano, BLane, JR A structure-activity analysis of biased agonism at the dopamine D2 receptor. J Med Chem56:9199-221 (2013) 
 
D(2) dopamine receptor
Name:D(2) dopamine receptor
Type:Cell-surface receptors
Mol. Mass.:50647.10
Organism:Homo sapiens (Human)
Description:P14416
Residue:443
BDBM50443102
NameBDBM50443102
Synonyms:CHEMBL3085819
TypeSmall organic molecule
Emp. Form.C20H27N3O
Mol. Mass.325.4479
SMILESCC(=O)N[C@H]1CC[C@H](CCN2CCc3ccc(cc3C2)C#N)CC1