Reaction Details
TargetMacrophage colony-stimulating factor 1 receptor
LigandBDBM119043
Substrate/Competitorn/a
Meas. Tech.ChEMBL_1276356 (CHEMBL3088374)
IC50 0.800000±n/a nM
Citation Illig, CRManthey, CLMeegalla, SKWall, MJChen, JWilson, KJDesJarlais, RLBallentine, SKSchubert, CCrysler, CSChen, YMolloy, CJChaikin, MADonatelli, RRYurkow, EZhou, ZPlayer, MRTomczuk, BE Enhancement of kinase selectivity in a potent class of arylamide FMS inhibitors. Bioorg Med Chem Lett23:6363-9 (2013) 
 
Macrophage colony-stimulating factor 1 receptor
Name:Macrophage colony-stimulating factor 1 receptor
Type:Protein
Mol. Mass.:107979.48
Organism:Homo sapiens (Human)
Description:P07333
Residue:972
BDBM119043
NameBDBM119043
Synonyms:CHEMBL3085978 US9221797, 60
TypeSmall organic molecule
Emp. Form.C25H31N5O2
Mol. Mass.433.5459
SMILESCC1(C)CCC(=CC1)c1cc(CCN2CCOCC2)ccc1NC(=O)c1ncc([nH]1)C#N