Reaction Details
TargetMacrophage colony-stimulating factor 1 receptor
LigandBDBM50443140
Substrate/Competitorn/a
Meas. Tech.ChEMBL_1276356 (CHEMBL3088374)
IC50 0.800000±n/a nM
Citation Illig, CRManthey, CLMeegalla, SKWall, MJChen, JWilson, KJDesJarlais, RLBallentine, SKSchubert, CCrysler, CSChen, YMolloy, CJChaikin, MADonatelli, RRYurkow, EZhou, ZPlayer, MRTomczuk, BE Enhancement of kinase selectivity in a potent class of arylamide FMS inhibitors. Bioorg Med Chem Lett23:6363-9 (2013) 
 
Macrophage colony-stimulating factor 1 receptor
Name:Macrophage colony-stimulating factor 1 receptor
Type:Protein
Mol. Mass.:107979.48
Organism:Homo sapiens (Human)
Description:P07333
Residue:972
BDBM50443140
NameBDBM50443140
Synonyms:CHEMBL3085984 | US8674100, 150
TypeSmall organic molecule
Emp. Form.C26H34N6O2
Mol. Mass.462.5872
SMILESCC1(C)CCC(=CC1)c1cc(CN2CCN(CCO)CC2)ccc1NC(=O)c1ncc([nH]1)C#N