Reaction Details
TargetTyrosine-protein kinase ITK/TSK
LigandBDBM50443177
Substrate/Competitorn/a
Meas. Tech.ChEMBL_1276382 (CHEMBL3088400)
Ki 2.5±n/a nM
Citation MacKinnon, CHLau, KBurch, JDChen, YDines, JDing, XEigenbrot, CHeifetz, AJaochico, AJohnson, AKraemer, JKruger, SKrülle, TMLiimatta, MLy, JMaghames, RMontalbetti, CAOrtwine, DFPérez-Fuertes, YShia, SStein, DBTrani, GVaidya, DGWang, XBromidge, SMWu, LCPei, Z Structure-based design and synthesis of potent benzothiazole inhibitors of interleukin-2 inducible T cell kinase (ITK). Bioorg Med Chem Lett23:6331-5 (2013) 
 
Tyrosine-protein kinase ITK/TSK
Name:Tyrosine-protein kinase ITK/TSK
Type:Protein
Mol. Mass.:71839.20
Organism:Homo sapiens (Human)
Description:Q08881
Residue:620
BDBM50443177
NameBDBM50443177
Synonyms:CHEMBL3086533
TypeSmall organic molecule
Emp. Form.C21H18N4O2S
Mol. Mass.390.458
SMILESCOc1ccc(cc1)[C@H]1C[C@@H]1C(=O)Nc1nc2ccc(cc2s1)-c1cn[nH]c1