Reaction Details
TargetTyrosine-protein kinase ITK/TSK
LigandBDBM50443193
Substrate/Competitorn/a
Meas. Tech.ChEMBL_1276382 (CHEMBL3088400)
Ki 380±n/a nM
Citation MacKinnon, CHLau, KBurch, JDChen, YDines, JDing, XEigenbrot, CHeifetz, AJaochico, AJohnson, AKraemer, JKruger, SKrülle, TMLiimatta, MLy, JMaghames, RMontalbetti, CAOrtwine, DFPérez-Fuertes, YShia, SStein, DBTrani, GVaidya, DGWang, XBromidge, SMWu, LCPei, Z Structure-based design and synthesis of potent benzothiazole inhibitors of interleukin-2 inducible T cell kinase (ITK). Bioorg Med Chem Lett23:6331-5 (2013) 
 
Tyrosine-protein kinase ITK/TSK
Name:Tyrosine-protein kinase ITK/TSK
Type:Protein
Mol. Mass.:71839.20
Organism:Homo sapiens (Human)
Description:Q08881
Residue:620
BDBM50443193
NameBDBM50443193
Synonyms:CHEMBL3086540
TypeSmall organic molecule
Emp. Form.C19H15N3O2S
Mol. Mass.349.406
SMILESCOc1ccc2nc(NC(=O)[C@H]3C[C@@H]3c3ccc(cc3)C#N)sc2c1