Reaction Details
TargetHistamine H3 receptor
LigandBDBM50443217
Substrate/Competitorn/a
Meas. Tech.ChEMBL_1276752 (CHEMBL3089260)
Ki 0.900000±n/a nM
Citation Gao, ZHurst, WJCzechtizky, WHall, DMoindrot, NNagorny, RPichat, PStefany, DHendrix, JAGeorge, PG Identification and profiling of 3,5-dimethyl-isoxazole-4-carboxylic acid [2-methyl-4-((2S,3'S)-2-methyl-[1,3']bipyrrolidinyl-1'-yl)phenyl] amide as histamine H(3) receptor antagonist for the treatment of depression. Bioorg Med Chem Lett23:6269-73 (2013) 
 
Histamine H3 receptor
Name:Histamine H3 receptor
Type:G Protein-Coupled Receptor (GPCR)
Mol. Mass.:48607.98
Organism:Rattus norvegicus (rat)
Description:n/a
Residue:445
BDBM50443217
NameBDBM50443217
Synonyms:CHEMBL3087669
TypeSmall organic molecule
Emp. Form.C22H30N4O2
Mol. Mass.382.4992
SMILESC[C@H]1CCCN1[C@H]1CCN(C1)c1ccc(NC(=O)c2c(C)noc2C)c(C)c1