Reaction Details
TargetHistamine receptor H3
LigandBDBM50443227
Substrate/Competitorn/a
Meas. Tech.ChEMBL_1276755 (CHEMBL3089263)
Ki 1.4±n/a nM
Citation Gao, ZHurst, WJCzechtizky, WHall, DMoindrot, NNagorny, RPichat, PStefany, DHendrix, JAGeorge, PG Identification and profiling of 3,5-dimethyl-isoxazole-4-carboxylic acid [2-methyl-4-((2S,3'S)-2-methyl-[1,3']bipyrrolidinyl-1'-yl)phenyl] amide as histamine H(3) receptor antagonist for the treatment of depression. Bioorg Med Chem Lett23:6269-73 (2013) 
 
Histamine receptor H3
Name:Histamine receptor H3
Synonyms:n/a
Type:Enzyme
Mol. Mass.:48611.84
Organism:Macaca mulatta (Rhesus macaque)
Description:Q865E1
Residue:445
BDBM50443227
NameBDBM50443227
Synonyms:CHEMBL3087356
TypeSmall organic molecule
Emp. Form.C23H30N4O
Mol. Mass.378.5105
SMILESC[C@H]1CCCN1[C@H]1CCN(C1)c1ccc(NC(=O)c2cccc(C)n2)c(C)c1