Reaction Details
Target17-beta-hydroxysteroid dehydrogenase type 3
LigandBDBM50443289
Substrate/Competitorn/a
Meas. Tech.ChEMBL_1274566 (CHEMBL3091166)
IC50 14±n/a nM
Citation Djigoué, GBKenmogne, LCRoy, JPoirier, D Synthesis of 3-spiromorpholinone androsterone derivatives as inhibitors of 17ß-hydroxysteroid dehydrogenase type 3. Bioorg Med Chem Lett23:6360-2 (2013) 
 
17-beta-hydroxysteroid dehydrogenase type 3
Name:17-beta-hydroxysteroid dehydrogenase type 3
Type:PROTEIN
Mol. Mass.:34235.73
Organism:Rattus norvegicus
Description:ChEMBL_1510493
Residue:306
BDBM50443289
NameBDBM50443289
Synonyms:CHEMBL3088217
TypeSmall organic molecule
Emp. Form.C33H47F3N2O4S
Mol. Mass.624.797
SMILESCC1CN(C(C)CN1C[C@@]1(O)CC[C@@]2(C)[C@@H](CC[C@H]3[C@@H]4CCC(=O)[C@@]4(C)CC[C@H]23)C1)S(=O)(=O)c1ccccc1C(F)(F)F