Reaction Details
TargetLysosomal Pro-X carboxypeptidase
LigandBDBM50443348
Substrate/Competitorn/a
Meas. Tech.ChEMBL_1275524 (CHEMBL3090539)
IC50 0.280000±n/a nM
Citation Debenham, JSGraham, THVerras, AZhang, YClements, MJKuethe, JTMadsen-Duggan, CLiu, WBhatt, URChen, DChen, QGarcia-Calvo, MGeissler, WMHe, HLi, XLisnock, JShen, ZTong, XTung, ECWiltsie, JXu, SHale, JJPinto, SShen, DM Discovery and optimization of orally active cyclohexane-based prolylcarboxypeptidase (PrCP) inhibitors. Bioorg Med Chem Lett23:6228-33 (2013) 
 
Lysosomal Pro-X carboxypeptidase
Name:Lysosomal Pro-X carboxypeptidase
Type:PROTEIN
Mol. Mass.:55028.96
Organism:Mus musculus
Description:ChEMBL_1335505
Residue:491
BDBM50443348
NameBDBM50443348
Synonyms:CHEMBL3086040 | US8669252, 12
TypeSmall organic molecule
Emp. Form.C29H30BrClFN3O2
Mol. Mass.586.923
SMILESFc1cc(ccn1)C(NC(=O)[C@@H]1CC[C@H](C[C@H]1c1ccc(Br)cc1)N1CCOCC1)c1ccc(Cl)cc1