Reaction Details
TargetNeuropeptide S receptor
LigandBDBM50443400
Substrate/Competitorn/a
Meas. Tech.ChEMBL_1276606 (CHEMBL3088891)
IC50 3.4±n/a nM
Citation Patnaik, SMarugan, JJLiu, KZheng, WSouthall, NDehdashti, SJThorsell, AHeilig, MBell, LZook, MEskay, BBrimacombe, KRAustin, CP Structure-activity relationship of imidazopyridinium analogues as antagonists of neuropeptide s receptor. J Med Chem56:9045-56 (2013) 
 
Neuropeptide S receptor
Name:Neuropeptide S receptor
Type:PROTEIN
Mol. Mass.:42692.30
Organism:Homo sapiens (Human)
Description:ChEMBL_1276607
Residue:371
BDBM50443400
NameBDBM50443400
Synonyms:CHEMBL3086821
TypeSmall organic molecule
Emp. Form.C29H25FN2PS
Mol. Mass.483.559
SMILESCc1c(n2ccccc2[n+]1C\C=C\c1ccc(F)cc1)P(=S)(c1ccccc1)c1ccccc1