Reaction Details
TargetCyclin-T1/Cyclin-dependent kinase 9
LigandBDBM50443454
Substrate/Competitorn/a
Meas. Tech.ChEMBL_1274643 (CHEMBL3089979)
Ki 11±n/a nM
Citation Shao, HShi, SFoley, DWLam, FAbbas, AYLiu, XHuang, SJiang, XBaharin, NFischer, PMWang, S Synthesis, structure-activity relationship and biological evaluation of 2,4,5-trisubstituted pyrimidine CDK inhibitors as potential anti-tumour agents. Eur J Med Chem70:447-55 (2013) 
 
Cyclin-T1/Cyclin-dependent kinase 9
Name:Cyclin-T1/Cyclin-dependent kinase 9
Type:Protein Complex
Mol. Mass.:n/a
Description:n/a
Components:This complex has 2 components.
Component 1
Name:Cyclin-T1
Synonyms:CCNT1 CycT Cyclin T Cyclin-T
Type:Enzyme Subunit
Mol. Mass.:80712.40
Organism:Homo sapiens (Human)
Description:n/a
Residue:726
Component 2
Name:Cyclin-dependent kinase 9
Synonyms:C-2K CDK9 Cell division cycle 2-like protein kinase 4 Cyclin-Dependent Kinase 9 (CDK9) Serine/threonine-protein kinase PITALRE Tat-associated kinase complex catalytic subunit
Type:Enzyme Subunit
Mol. Mass.:42789.13
Organism:Homo sapiens (Human)
Description:n/a
Residue:372
BDBM50443454
NameBDBM50443454
Synonyms:CHEMBL3087446
TypeSmall organic molecule
Emp. Form.C20H22FN7OS
Mol. Mass.427.498
SMILESCC(=O)N1CCN(CC1)c1cccc(Nc2ncc(F)c(n2)-c2sc(N)nc2C)c1