Reaction Details
TargetCyclin-A2/Cyclin-dependent kinase 2
LigandBDBM50443450
Substrate/Competitorn/a
Meas. Tech.ChEMBL_1274641 (CHEMBL3089977)
Ki 22±n/a nM
Citation Shao, HShi, SFoley, DWLam, FAbbas, AYLiu, XHuang, SJiang, XBaharin, NFischer, PMWang, S Synthesis, structure-activity relationship and biological evaluation of 2,4,5-trisubstituted pyrimidine CDK inhibitors as potential anti-tumour agents. Eur J Med Chem70:447-55 (2013) 
 
Cyclin-A2/Cyclin-dependent kinase 2
Name:Cyclin-A2/Cyclin-dependent kinase 2
Type:Protein Complex
Mol. Mass.:n/a
Description:Cdk2/Cyclin A kinase was purified from insect cells coinfected with Cyclin A/Cdk2 baculovirus.
Components:This complex has 2 components.
Component 1
Name:Cyclin-dependent kinase 2
Synonyms:CDK2 CDK2_HUMAN Cell division protein kinase 2 Protein cereblon/Cyclin-dependent kinase 2 | p33 protein kinase
Type:Enzyme Subunit
Mol. Mass.:33938.17
Organism:Homo sapiens (Human)
Description:P24941
Residue:298
Component 2
Name:Cyclin-A2
Synonyms:CCN1 CCNA1 CCNA2_HUMAN Cyclin-A
Type:Enzyme Subunit
Mol. Mass.:48550.19
Organism:Homo sapiens (Human)
Description:P20248
Residue:432
BDBM50443450
NameBDBM50443450
Synonyms:CHEMBL3087443
TypeSmall organic molecule
Emp. Form.C19H21N7O3S2
Mol. Mass.459.545
SMILESCNc1nc(C)c(s1)-c1nc(Nc2cccc(c2)S(=O)(=O)NCCOC)ncc1C#N