Reaction Details
TargetCyclin-dependent kinase/G2/mitotic-specific cyclin- 1
LigandBDBM50443457
Substrate/Competitorn/a
Meas. Tech.ChEMBL_1274642 (CHEMBL3089978)
Ki 43±n/a nM
Citation Shao, HShi, SFoley, DWLam, FAbbas, AYLiu, XHuang, SJiang, XBaharin, NFischer, PMWang, S Synthesis, structure-activity relationship and biological evaluation of 2,4,5-trisubstituted pyrimidine CDK inhibitors as potential anti-tumour agents. Eur J Med Chem70:447-55 (2013) 
 
Cyclin-dependent kinase/G2/mitotic-specific cyclin- 1
Name:Cyclin-dependent kinase/G2/mitotic-specific cyclin- 1
Type:Protein Complex
Mol. Mass.:n/a
Description:CDK1/Cyclin B complexes were purified from insect cells co-infected with baculovirus vectors containing each of the components.
Components:This complex has 2 components.
Component 1
Name:Cyclin-dependent kinase 1
Synonyms:CDC2 CDK1 CDKN1 Cell division protein kinase 1 P34CDC2 | p34 protein kinase
Type:Enzyme Subunit
Mol. Mass.:34101.08
Organism:Homo sapiens (Human)
Description:P06493
Residue:297
Component 2
Name:G2/mitotic-specific cyclin-B1
Synonyms:CCNB CCNB1_HUMAN
Type:Enzyme Subunit
Mol. Mass.:48340.95
Organism:Homo sapiens (Human)
Description:P14635
Residue:433
BDBM50443457
NameBDBM50443457
Synonyms:CHEMBL3087433
TypeSmall organic molecule
Emp. Form.C23H26N8OS
Mol. Mass.462.571
SMILESCNc1nc(C)c(s1)-c1nc(Nc2ccc(cc2)C(=O)NC2CCN(C)CC2)ncc1C#N