Reaction Details
TargetAurora kinase A
LigandBDBM50443494
Substrate/Competitorn/a
Meas. Tech.ChEMBL_1275024 (CHEMBL3090782)
IC50 270±n/a nM
Citation Bavetsias, VFaisal, ACrumpler, SBrown, NKosmopoulou, MJoshi, AAtrash, BPérez-Fuertes, YSchmitt, JABoxall, KJBurke, RSun, CAvery, SBush, KHenley, ARaynaud, FIWorkman, PBayliss, RLinardopoulos, SBlagg, J Aurora isoform selectivity: design and synthesis of imidazo[4,5-b]pyridine derivatives as highly selective inhibitors of Aurora-A kinase in cells. J Med Chem56:9122-35 (2013) 
 
Aurora kinase A
Name:Aurora kinase A
Type:Serine/threonine-protein kinase
Mol. Mass.:45830.98
Organism:Homo sapiens (Human)
Description:O14965
Residue:403
BDBM50443494
NameBDBM50443494
Synonyms:CHEMBL3087776
TypeSmall organic molecule
Emp. Form.C17H20ClN7O
Mol. Mass.373.84
SMILESCC(=O)N[C@H]1CCN(C1)c1c(Cl)cnc2nc([nH]c12)-c1cn(C)nc1C