Reaction Details
TargetAurora kinase A
LigandBDBM50443495
Substrate/Competitorn/a
Meas. Tech.ChEMBL_1275024 (CHEMBL3090782)
IC50 743±n/a nM
Citation Bavetsias, VFaisal, ACrumpler, SBrown, NKosmopoulou, MJoshi, AAtrash, BPérez-Fuertes, YSchmitt, JABoxall, KJBurke, RSun, CAvery, SBush, KHenley, ARaynaud, FIWorkman, PBayliss, RLinardopoulos, SBlagg, J Aurora isoform selectivity: design and synthesis of imidazo[4,5-b]pyridine derivatives as highly selective inhibitors of Aurora-A kinase in cells. J Med Chem56:9122-35 (2013) 
 
Aurora kinase A
Name:Aurora kinase A
Type:Serine/threonine-protein kinase
Mol. Mass.:45830.98
Organism:Homo sapiens (Human)
Description:O14965
Residue:403
BDBM50443495
NameBDBM50443495
Synonyms:CHEMBL3087775
TypeSmall organic molecule
Emp. Form.C23H20ClN3O2
Mol. Mass.405.877
SMILESCOc1ccc(cc1)-c1[nH]c2ncc(Cl)cc2c1-c1cccc(CNC(C)=O)c1