Reaction Details
TargetAurora kinase A
LigandBDBM50443496
Substrate/Competitorn/a
Meas. Tech.ChEMBL_1275024 (CHEMBL3090782)
IC50 118±n/a nM
Citation Bavetsias, VFaisal, ACrumpler, SBrown, NKosmopoulou, MJoshi, AAtrash, BPérez-Fuertes, YSchmitt, JABoxall, KJBurke, RSun, CAvery, SBush, KHenley, ARaynaud, FIWorkman, PBayliss, RLinardopoulos, SBlagg, J Aurora isoform selectivity: design and synthesis of imidazo[4,5-b]pyridine derivatives as highly selective inhibitors of Aurora-A kinase in cells. J Med Chem56:9122-35 (2013) 
 
Aurora kinase A
Name:Aurora kinase A
Type:Serine/threonine-protein kinase
Mol. Mass.:45830.98
Organism:Homo sapiens (Human)
Description:O14965
Residue:403
BDBM50443496
NameBDBM50443496
Synonyms:CHEMBL3087774
TypeSmall organic molecule
Emp. Form.C20H18ClN5O
Mol. Mass.379.843
SMILESCC(=O)NCc1cccc(c1)-c1c([nH]c2ncc(Cl)cc12)-c1cnn(C)c1