Reaction Details
TargetAurora kinase A
LigandBDBM50443497
Substrate/Competitorn/a
Meas. Tech.ChEMBL_1275024 (CHEMBL3090782)
IC50 1941±n/a nM
Citation Bavetsias, VFaisal, ACrumpler, SBrown, NKosmopoulou, MJoshi, AAtrash, BPérez-Fuertes, YSchmitt, JABoxall, KJBurke, RSun, CAvery, SBush, KHenley, ARaynaud, FIWorkman, PBayliss, RLinardopoulos, SBlagg, J Aurora isoform selectivity: design and synthesis of imidazo[4,5-b]pyridine derivatives as highly selective inhibitors of Aurora-A kinase in cells. J Med Chem56:9122-35 (2013) 
 
Aurora kinase A
Name:Aurora kinase A
Type:Serine/threonine-protein kinase
Mol. Mass.:45830.98
Organism:Homo sapiens (Human)
Description:O14965
Residue:403
BDBM50443497
NameBDBM50443497
Synonyms:CHEMBL3087773
TypeSmall organic molecule
Emp. Form.C22H20ClN3O3S
Mol. Mass.441.931
SMILESCOc1ccc(cc1)-c1[nH]c2ncc(Cl)cc2c1-c1cccc(CNS(C)(=O)=O)c1