Reaction Details
TargetAurora kinase B
LigandBDBM50443499
Substrate/Competitorn/a
Meas. Tech.ChEMBL_1275018 (CHEMBL3090776)
IC50 24240±n/a nM
Citation Bavetsias, VFaisal, ACrumpler, SBrown, NKosmopoulou, MJoshi, AAtrash, BPérez-Fuertes, YSchmitt, JABoxall, KJBurke, RSun, CAvery, SBush, KHenley, ARaynaud, FIWorkman, PBayliss, RLinardopoulos, SBlagg, J Aurora isoform selectivity: design and synthesis of imidazo[4,5-b]pyridine derivatives as highly selective inhibitors of Aurora-A kinase in cells. J Med Chem56:9122-35 (2013) 
 
Aurora kinase B
Name:Aurora kinase B
Type:Protein
Mol. Mass.:39327.72
Organism:Homo sapiens (Human)
Description:Q96GD4
Residue:344
BDBM50443499
NameBDBM50443499
Synonyms:CHEMBL3087823
TypeSmall organic molecule
Emp. Form.C22H21ClN6O2
Mol. Mass.436.894
SMILESCc1nn(C)cc1-c1nc2ncc(Cl)c(Oc3ccc(cc3)C(=O)NC3CCC3)c2[nH]1