Reaction Details
TargetAurora kinase B
LigandBDBM50443503
Substrate/Competitorn/a
Meas. Tech.ChEMBL_1275018 (CHEMBL3090776)
IC50 19740±n/a nM
Citation Bavetsias, VFaisal, ACrumpler, SBrown, NKosmopoulou, MJoshi, AAtrash, BPérez-Fuertes, YSchmitt, JABoxall, KJBurke, RSun, CAvery, SBush, KHenley, ARaynaud, FIWorkman, PBayliss, RLinardopoulos, SBlagg, J Aurora isoform selectivity: design and synthesis of imidazo[4,5-b]pyridine derivatives as highly selective inhibitors of Aurora-A kinase in cells. J Med Chem56:9122-35 (2013) 
 
Aurora kinase B
Name:Aurora kinase B
Type:Protein
Mol. Mass.:39327.72
Organism:Homo sapiens (Human)
Description:Q96GD4
Residue:344
BDBM50443503
NameBDBM50443503
Synonyms:CHEMBL3087819
TypeSmall organic molecule
Emp. Form.C23H18ClN7O2
Mol. Mass.459.888
SMILESCc1nn(C)cc1-c1nc2ncc(Cl)c(Oc3ccc(cc3)C(=O)Nc3ccncc3)c2[nH]1