Reaction Details
TargetAurora kinase B
LigandBDBM50443509
Substrate/Competitorn/a
Meas. Tech.ChEMBL_1275023 (CHEMBL3090781)
IC50 17±n/a nM
Citation Bavetsias, VFaisal, ACrumpler, SBrown, NKosmopoulou, MJoshi, AAtrash, BPérez-Fuertes, YSchmitt, JABoxall, KJBurke, RSun, CAvery, SBush, KHenley, ARaynaud, FIWorkman, PBayliss, RLinardopoulos, SBlagg, J Aurora isoform selectivity: design and synthesis of imidazo[4,5-b]pyridine derivatives as highly selective inhibitors of Aurora-A kinase in cells. J Med Chem56:9122-35 (2013) 
 
Aurora kinase B
Name:Aurora kinase B
Type:Protein
Mol. Mass.:39327.72
Organism:Homo sapiens (Human)
Description:Q96GD4
Residue:344
BDBM50443509
NameBDBM50443509
Synonyms:CHEMBL3087780
TypeSmall organic molecule
Emp. Form.C18H24ClN7O2S
Mol. Mass.437.947
SMILESCc1nn(C)cc1-c1nc2ncc(Cl)c(N3CCC[C@@H](CNS(C)(=O)=O)C3)c2[nH]1