Reaction Details
TargetAurora kinase A
LigandBDBM50443500
Substrate/Competitorn/a
Meas. Tech.ChEMBL_1275024 (CHEMBL3090782)
IC50 67±n/a nM
Citation Bavetsias, VFaisal, ACrumpler, SBrown, NKosmopoulou, MJoshi, AAtrash, BPérez-Fuertes, YSchmitt, JABoxall, KJBurke, RSun, CAvery, SBush, KHenley, ARaynaud, FIWorkman, PBayliss, RLinardopoulos, SBlagg, J Aurora isoform selectivity: design and synthesis of imidazo[4,5-b]pyridine derivatives as highly selective inhibitors of Aurora-A kinase in cells. J Med Chem56:9122-35 (2013) 
 
Aurora kinase A
Name:Aurora kinase A
Type:Serine/threonine-protein kinase
Mol. Mass.:45830.98
Organism:Homo sapiens (Human)
Description:O14965
Residue:403
BDBM50443500
NameBDBM50443500
Synonyms:CHEMBL3087784
TypeSmall organic molecule
Emp. Form.C24H19ClN6O2
Mol. Mass.458.9
SMILESCc1nn(C)cc1-c1nc2ncc(Cl)c(Oc3ccc(cc3)C(=O)Nc3ccccc3)c2[nH]1